BDBM50206700 CHEMBL3942198
SMILES CC[C@H](C)[C@H](NC(=O)C1(CCOC1c1ccc(Br)cc1)NC(=O)[C@@H]1CCCN1C(=O)[C@H](CCCNC(N)=N)NC(=O)[C@@H](N)CCCNC(N)=N)C(=O)N[C@@H](CC(C)C)C(O)=O
InChI Key InChIKey=SNDVFAKLFRYOKC-MJQLLIAXSA-N
Data  2 KI
  Tab Delimited (TSV)   2D SDfile   Computed 3D by Vconf -m prep SDfile
Find this compound or compounds like it in BindingDB:
Activity Spreadsheet -- Enzyme Inhibition Constant Data from BindingDB
Found 2 hits for monomerid = 50206700
TargetNeurotensin receptor type 2(Homo sapiens (Human))
University Of Regensburg
Curated by ChEMBL
LigandPNGBDBM50206700(CHEMBL3942198)
Affinity DataKi:  12nM. Assay description: Displacement of [leucine-3H]NT (8 to 13 residues) from human NTS2 receptor expressed in HEK293 cell membranes after 60 mins by scintillation counting
In DepthDetails ArticlePubMed
TargetNeurotensin receptor type 1(Homo sapiens (Human))
University Of Regensburg
Curated by ChEMBL
LigandPNGBDBM50206700(CHEMBL3942198)
Affinity DataKi:  870nM. Assay description: Displacement of [3H]neurotensin from human NTS1 receptor expressed in CHOK1 cell membranes after 60 mins by scintillation counting
In DepthDetails ArticlePubMed