BDBM50206702 CHEMBL3971946
SMILES CC(C)C[C@H](NC(=O)CNC(=O)[C@]1(CCO[C@H]1c1ccc(O)cc1)NC(=O)[C@@H]1CCCN1C(=O)[C@H](CCCNC(N)=N)NC(=O)[C@@H](N)CCCNC(N)=N)C(O)=O
InChI Key InChIKey=ITDNHCVOGVXTKF-SATRMGJLSA-N
Data  2 KI
  Tab Delimited (TSV)   2D SDfile   Computed 3D by Vconf -m prep SDfile
Find this compound or compounds like it in BindingDB:
Activity Spreadsheet -- Enzyme Inhibition Constant Data from BindingDB
Found 2 hits for monomerid = 50206702
TargetNeurotensin receptor type 2(Homo sapiens (Human))
University Of Regensburg
Curated by ChEMBL
LigandPNGBDBM50206702(CHEMBL3971946)
Affinity DataKi:  29nM. Assay description: Displacement of [leucine-3H]NT (8 to 13 residues) from human NTS2 receptor expressed in HEK293 cell membranes after 60 mins by scintillation counting
In DepthDetails ArticlePubMed
TargetNeurotensin receptor type 1(Homo sapiens (Human))
University Of Regensburg
Curated by ChEMBL
LigandPNGBDBM50206702(CHEMBL3971946)
Affinity DataKi:  3.50E+4nM. Assay description: Displacement of [3H]neurotensin from human NTS1 receptor expressed in CHOK1 cell membranes after 60 mins by scintillation counting
In DepthDetails ArticlePubMed