BDBM50206750 CHEMBL3943620
SMILES [H][C@]12CCc3cc(OC)c(Cl)c(Cl)c3N1CCCNC2
InChI Key InChIKey=JXZIRKVMBRRCCK-SNVBAGLBSA-N
Data  1 EC50
  Tab Delimited (TSV)   2D SDfile   Computed 3D by Vconf -m prep SDfile
Find this compound or compounds like it in BindingDB:
Activity Spreadsheet -- Enzyme Inhibition Constant Data from BindingDB
Found 1 hit for monomerid = 50206750
Target5-hydroxytryptamine receptor 2C(Homo sapiens (Human))
Arena Pharmaceuticals
Curated by ChEMBL
LigandPNGBDBM50206750(CHEMBL3943620)
Affinity DataEC50:  10nM. Assay description: Agonist activity at unedited 5-HT2C receptor (unknown origin) expressed in HEK293 cells assessed as [3H]inositol phosphate accumulation after 2 hrs b...
In DepthDetails ArticlePubMed