BDBM50206826 (R)-3-amino-1-(pyrazolidin-1-yl)-4-(2,4,5-trifluorophenyl)butan-1-one hydrochloride::CHEMBL534959
SMILES N[C@@H](CC(=O)N1CCCN1)Cc1cc(F)c(F)cc1F
InChI Key InChIKey=DWANRVIDDFLZAU-SECBINFHSA-N
Data  1 IC50
  Tab Delimited (TSV)   2D SDfile   Computed 3D by Vconf -m prep SDfile
Find this compound or compounds like it in BindingDB:
Activity Spreadsheet -- Enzyme Inhibition Constant Data from BindingDB
Found 1 hit for monomerid = 50206826
TargetDipeptidyl peptidase 4(Homo sapiens (Human))
Korea Research Institute Of Chemical Technology
Curated by ChEMBL
LigandPNGBDBM50206826((R)-3-amino-1-(pyrazolidin-1-yl)-4-(2,4,5-trifluor...)
Affinity DataIC50:  3.85E+3nM. Assay description: Inhibition of DPP4
In DepthDetails ArticlePubMed