BDBM50206900 CHEMBL3895181
SMILES [H][C@@]12CC[C@@](O)(C#CC)[C@@]1(C)C[C@H](OCC=C)[C@]1([H])c3ccc(cc3CC[C@@]21[H])C(=O)Nc1cccnc1C
InChI Key InChIKey=VUQAUTBHSZAMGX-HIBPFCMCSA-N
Data  1 IC50  1 EC50
  Tab Delimited (TSV)   2D SDfile   Computed 3D by Vconf -m prep SDfile
Find this compound or compounds like it in BindingDB:
Activity Spreadsheet -- Enzyme Inhibition Constant Data from BindingDB
Found 2 hits for monomerid = 50206900
TargetGlucocorticoid receptor(Homo sapiens (Human))
The Scripps Research Institute
Curated by ChEMBL
LigandPNGBDBM50206900(CHEMBL3895181)
Affinity DataEC50:  0.110nM. Assay description: Agonist activity at GR in human HepG2 cells assessed as protein mediated-transcriptional activity by MMTV-promoter driven luciferase reporter gene as...
In DepthDetails ArticlePubMed
TargetGlucocorticoid receptor(Homo sapiens (Human))
The Scripps Research Institute
Curated by ChEMBL
LigandPNGBDBM50206900(CHEMBL3895181)
Affinity DataIC50:  0.0300nM. Assay description: Antagonist activity at GR in human HepG2 cells assessed as inhibition of protein mediated-transcriptional activity by MMTV-promoter driven luciferase...
In DepthDetails ArticlePubMed