BDBM50207012 4,5-dibromo-3-(2,2,2-trifluoroethoxy)thiophene-2-carboxylic acid::CHEMBL392472
SMILES OC(=O)c1sc(Br)c(Br)c1OCC(F)(F)F
InChI Key InChIKey=SXCXXSFYIZBLPP-UHFFFAOYSA-N
Data  1 IC50
  Tab Delimited (TSV)   2D SDfile   Computed 3D by Vconf -m prep SDfile
Find this compound or compounds like it in BindingDB:
Activity Spreadsheet -- Enzyme Inhibition Constant Data from BindingDB
Found 1 hit for monomerid = 50207012
TargetTyrosine-protein phosphatase non-receptor type 1(Homo sapiens (Human))
Wyeth Research
Curated by ChEMBL
LigandPNGBDBM50207012(4,5-dibromo-3-(2,2,2-trifluoroethoxy)thiophene-2-c...)
Affinity DataIC50: >2.50E+6nM. Assay description: Inhibition of PTP1B assessed as pNPP hydrolysis
In DepthDetails ArticlePubMed