BDBM50207432 CHEMBL3909479
SMILES COc1ccc(cc1)-c1nc(NCC(O)=O)sc1-c1ccc(OC)cc1
InChI Key InChIKey=YBNBDNHSPNKSSM-UHFFFAOYSA-N
Data  2 IC50
  Tab Delimited (TSV)   2D SDfile   Computed 3D by Vconf -m prep SDfile
Find this compound or compounds like it in BindingDB:
Activity Spreadsheet -- Enzyme Inhibition Constant Data from BindingDB
Found 2 hits for monomerid = 50207432
TargetProstaglandin G/H synthase 2(Homo sapiens (Human))
Beni-Suef University
Curated by ChEMBL
LigandPNGBDBM50207432(CHEMBL3909479)
Affinity DataIC50:  9.23E+3nM. Assay description: Inhibition of human recombinant COX-2 assessed as reduction in oxidation of TMPD using arachidonic acid as substrate preincubated for 5 mins followed...
In DepthDetails ArticlePubMed
TargetProstaglandin G/H synthase 1(Ovis aries (Sheep))
Beni-Suef University
Curated by ChEMBL
LigandPNGBDBM50207432(CHEMBL3909479)
Affinity DataIC50:  320nM. Assay description: Inhibition of ovine COX-1 assessed as reduction in oxidation of TMPD using arachidonic acid as substrate preincubated for 5 mins followed by substrat...
In DepthDetails ArticlePubMed