BDBM50207676 CHEMBL245642::N-(1-(3-fluoro-4-(2-(methoxyimino)ethoxy)benzyl)piperidin-4-yl)-7-fluoro-4-oxo-4H-chromene-2-carboxamide
SMILES CO\N=C\COc1ccc(CN2CCC(CC2)NC(=O)c2cc(=O)c3ccc(F)cc3o2)cc1F
InChI Key InChIKey=FQWJOAGZEYMASE-YLKCYHHESA-N
Data  3 IC50
  Tab Delimited (TSV)   2D SDfile   Computed 3D by Vconf -m prep SDfile
Find this compound or compounds like it in BindingDB:
Activity Spreadsheet -- Enzyme Inhibition Constant Data from BindingDB
Found 3 hits for monomerid = 50207676
TargetMelanin-concentrating hormone receptor 1(Homo sapiens (Human))
Abbott Laboratories
Curated by ChEMBL
LigandPNGBDBM50207676(CHEMBL245642 | N-(1-(3-fluoro-4-(2-(methoxyimino)e...)
Affinity DataIC50:  31nM. Assay description: Displacement of [125I]MCH from MCHR1 expressed in IMR32 cells
In DepthDetails ArticlePubMed
TargetMelanin-concentrating hormone receptor 1(Homo sapiens (Human))
Abbott Laboratories
Curated by ChEMBL
LigandPNGBDBM50207676(CHEMBL245642 | N-(1-(3-fluoro-4-(2-(methoxyimino)e...)
Affinity DataIC50:  480nM. Assay description: Antagonist activity at MCHR1 assessed as inhibition of MCH-mediated calcium release in IMR32 cells
In DepthDetails ArticlePubMed
TargetPotassium voltage-gated channel subfamily H member 2(Homo sapiens (Human))
Abbott Laboratories
Curated by ChEMBL
LigandPNGBDBM50207676(CHEMBL245642 | N-(1-(3-fluoro-4-(2-(methoxyimino)e...)
Affinity DataIC50:  3.20E+3nM. Assay description: Displacement of [3H]dofetilide from hERG expressed in HEK293 cell membrane
In DepthDetails ArticlePubMed