BDBM50207722 CHEMBL3931043
SMILES COc1cc2c(Oc3ccc(NC(=O)c4cn(cn4)-c4cc(C)ccc4C)cc3F)ccnc2cc1OCCCN1CCCCC1
InChI Key InChIKey=LTMSOZANODKLGC-UHFFFAOYSA-N
Data  1 IC50
  Tab Delimited (TSV)   2D SDfile   Computed 3D by Vconf -m prep SDfile
Find this compound or compounds like it in BindingDB:
Activity Spreadsheet -- Enzyme Inhibition Constant Data from BindingDB
Found 1 hit for monomerid = 50207722
TargetHepatocyte growth factor receptor(Homo sapiens (Human))
Shenyang Pharmaceutical University
Curated by ChEMBL
LigandPNGBDBM50207722(CHEMBL3931043)
Affinity DataIC50:  29nM. Assay description: Inhibition of c-MET (unknown origin) using poly (Glu, Tyr) 4:1 as substrate after 30 mins by HTRF assay
In DepthDetails ArticlePubMed