BDBM50207802 CHEMBL248168::cyclohexyl(4-ethylpiperazin-1-yl)methanone
SMILES CCN1CCN(CC1)C(=O)C1CCCCC1
InChI Key InChIKey=ULVBOFHJXQJBRH-UHFFFAOYSA-N
Data  1 IC50
  Tab Delimited (TSV)   2D SDfile   Computed 3D by Vconf -m prep SDfile
Find this compound or compounds like it in BindingDB:
Activity Spreadsheet -- Enzyme Inhibition Constant Data from BindingDB
Found 1 hit for monomerid = 50207802
Target11-beta-hydroxysteroid dehydrogenase 1(Homo sapiens (Human))
University Of Edinburgh
Curated by ChEMBL
LigandPNGBDBM50207802(CHEMBL248168 | cyclohexyl(4-ethylpiperazin-1-yl)me...)
Affinity DataIC50:  5.30E+4nM. Assay description: Inhibition of human 11beta-HSD1 expressed in HEK293 cells after 2 hrs by scintillation proximity assay
In DepthDetails ArticlePubMed