BDBM50208095 CHEMBL3919973
SMILES OC(=O)CC1CCC2(CC1)CCN(CC2)c1cc(OC(F)(F)F)ccc1Cl
InChI Key InChIKey=WUJVPELCYCESAP-UHFFFAOYSA-N
Data  6 EC50
  Tab Delimited (TSV)   2D SDfile   Computed 3D by Vconf -m prep SDfile
Find this compound or compounds like it in BindingDB:
Activity Spreadsheet -- Enzyme Inhibition Constant Data from BindingDB
Found 6 hits for monomerid = 50208095
TargetFree fatty acid receptor 4(Homo sapiens (Human))
Merck
Curated by ChEMBL
LigandPNGBDBM50208095(CHEMBL3919973)
Affinity DataEC50:  66nM. Assay description: Agonist activity at ARMS2-PK2 -tagged human GPR120 short isoform expressed in CHOK1 cells assessed as induction of beta-arrestin2 recruitment after 9...
In DepthDetails ArticlePubMed
TargetFree fatty acid receptor 4(Mus musculus)
Merck
Curated by ChEMBL
LigandPNGBDBM50208095(CHEMBL3919973)
Affinity DataEC50:  54nM. Assay description: Agonist activity at mouse GPR120 expressed in U2OS cells assessed as induction of beta-arrestin2 recruitment after 90 mins by luminescence assay
In DepthDetails ArticlePubMed
TargetFree fatty acid receptor 4(Homo sapiens (Human))
Merck
Curated by ChEMBL
LigandPNGBDBM50208095(CHEMBL3919973)
Affinity DataEC50:  66nM. Assay description: Agonist activity at ARMS2-PK2 -tagged human GPR120 short isoform expressed in CHOK1 cells assessed as induction of beta-arrestin2 recruitment after 9...
In DepthDetails ArticlePubMed
TargetFree fatty acid receptor 4(Mus musculus)
Merck
Curated by ChEMBL
LigandPNGBDBM50208095(CHEMBL3919973)
Affinity DataEC50:  33nM. Assay description: Agonist activity at mouse GPR120 expressed in CHOK1 cells assessed as induction of IP1 accumulation after 60 mins by HTRF assay
In DepthDetails ArticlePubMed
TargetFree fatty acid receptor 1(Homo sapiens (Human))
Merck
Curated by ChEMBL
LigandPNGBDBM50208095(CHEMBL3919973)
Affinity DataEC50: >1.00E+4nM. Assay description: Agonist activity at human GPR40 expressed in HEK293 cells assessed as induction of IP1 accumulation after 60 mins by HTRF assay
In DepthDetails ArticlePubMed
TargetFree fatty acid receptor 4(Homo sapiens (Human))
Merck
Curated by ChEMBL
LigandPNGBDBM50208095(CHEMBL3919973)
Affinity DataEC50:  98nM. Assay description: Agonist activity at human GPR120 short isoform expressed in CHOK1 cells assessed as induction of IP1 accumulation after 60 mins by HTRF assay
In DepthDetails ArticlePubMed