BDBM50208426 CHEMBL3883795
SMILES COc1ccc(C[C@H](NS(C)(=O)=O)C(=O)NCCCOc2c(CCSC)c(nn2-c2ccc(Cl)c(Cl)c2)-c2cccnc2)cc1
InChI Key InChIKey=AKISYNXNLQGAGL-NDEPHWFRSA-N
Data  1 IC50
  Tab Delimited (TSV)   2D SDfile   Computed 3D by Vconf -m prep SDfile
Find this compound or compounds like it in BindingDB:
Activity Spreadsheet -- Enzyme Inhibition Constant Data from BindingDB
Found 1 hit for monomerid = 50208426
TargetGlutathione hydrolase 1 proenzyme(Homo sapiens (Human))
King Fahd University Of Petroleum And Minerals
Curated by ChEMBL
LigandPNGBDBM50208426(CHEMBL3883795)
Affinity DataIC50:  9.90E+3nM. Assay description: Inhibition of recombinant GGT1 (unknown origin) using GGPP as substrate preincubated for 5 mins followed by protein addition measured over 20 mins by...
In DepthDetails ArticlePubMed