BDBM50208484 (3S)-1-(1,3-BENZODIOXOL-5-YLMETHYL)-3-[4-(1H-IMIDAZOL-1-YL)PHENOXY]PIPERIDINE::(S)-3-(4-(1H-imidazol-1-yl)phenoxy)-1-(benzo[d][1,3]dioxol-5-ylmethyl)piperidine::CHEMBL232827
SMILES C(N1CCC[C@@H](C1)Oc1ccc(cc1)-n1ccnc1)c1ccc2OCOc2c1
InChI Key InChIKey=HHOPJGKEAIIIDF-FQEVSTJZSA-N
Data  1 IC50
PDB links: 1 PDB ID matches this monomer.
  Tab Delimited (TSV)   2D SDfile   Computed 3D by Vconf -m prep SDfile
Find this compound or compounds like it in BindingDB:
Activity Spreadsheet -- Enzyme Inhibition Constant Data from BindingDB
Found 1 hit for monomerid = 50208484
TargetNitric oxide synthase, inducible(Homo sapiens (Human))
Berlex Biosciences
Curated by ChEMBL
LigandPNGBDBM50208484((3S)-1-(1,3-BENZODIOXOL-5-YLMETHYL)-3-[4-(1H-IMIDA...)
Affinity DataIC50:  72nM. Assay description: Inhibition of tetracycline-induced iNOS expressed in SF9 cells