BDBM50208854 (R)-N-((R)-3-cyanopyrrolidin-3-yl)-2-(cyclohexylmethyl)-4-morpholino-4-oxobutanamide::CHEMBL397733
SMILES O=C(C[C@@H](CC1CCCCC1)C(=O)N[C@@]1(CCNC1)C#N)N1CCOCC1
InChI Key InChIKey=XVGOIXYOFINVIC-XLIONFOSSA-N
Data  1 IC50  1 Kd
  Tab Delimited (TSV)   2D SDfile   Computed 3D by Vconf -m prep SDfile
Find this compound or compounds like it in BindingDB:
Activity Spreadsheet -- Enzyme Inhibition Constant Data from BindingDB
Found 2 hits for monomerid = 50208854
TargetCathepsin S(Homo sapiens (Human))
Boehringer Ingelheim Pharmaceuticals
Curated by ChEMBL
LigandPNGBDBM50208854((R)-N-((R)-3-cyanopyrrolidin-3-yl)-2-(cyclohexylme...)
Affinity DataKd:  123nM. Assay description: Inhibition of human cathepsin S
In DepthDetails ArticlePubMed
TargetCathepsin S(Homo sapiens (Human))
Boehringer Ingelheim Pharmaceuticals
Curated by ChEMBL
LigandPNGBDBM50208854((R)-N-((R)-3-cyanopyrrolidin-3-yl)-2-(cyclohexylme...)
Affinity DataIC50:  141nM. Assay description: Inhibition of human cathepsin S
In DepthDetails ArticlePubMed