BDBM50208920 CHEMBL3884535
SMILES CC1(C)C(=O)N(C2CCCCC2)c2nc(Nc3cccc(c3)N3CCNCC3)ncc12
InChI Key InChIKey=LOZGENZISGZHOI-UHFFFAOYSA-N
Data  2 IC50
  Tab Delimited (TSV)   2D SDfile   Computed 3D by Vconf -m prep SDfile
Find this compound or compounds like it in BindingDB:
Activity Spreadsheet -- Enzyme Inhibition Constant Data from BindingDB
Found 2 hits for monomerid = 50208920
TargetMAP/microtubule affinity-regulating kinase 3(Homo sapiens (Human))
Merck
Curated by ChEMBL
LigandPNGBDBM50208920(CHEMBL3884535)
Affinity DataIC50:  14nM. Assay description: Inhibition of full length human MARK3 using biotin labeled peptide substrate by HTRF based assay
In DepthDetails ArticlePubMed
TargetMAP/microtubule affinity-regulating kinase 4(Homo sapiens (Human))
Merck
Curated by ChEMBL
LigandPNGBDBM50208920(CHEMBL3884535)
Affinity DataIC50:  920nM. Assay description: Inhibition of human MARK4 expressed in HEK293T cells coexpressing tau protein assessed as reduction in tau phosphorylation at Ser262 residues by Alph...
In DepthDetails ArticlePubMed