BDBM50208996 CHEMBL3884580
SMILES OC(=O)CCCNCc1cc2cccc(-c3ccc(cc3)-c3ccccc3)c2s1
InChI Key InChIKey=UVRRDWQINLOLQQ-UHFFFAOYSA-N
Data  2 EC50
  Tab Delimited (TSV)   2D SDfile   Computed 3D by Vconf -m prep SDfile
Find this compound or compounds like it in BindingDB:
Activity Spreadsheet -- Enzyme Inhibition Constant Data from BindingDB
Found 2 hits for monomerid = 50208996
TargetSphingosine 1-phosphate receptor 5(Homo sapiens (Human))
Harvard Medical School
Curated by ChEMBL
LigandPNGBDBM50208996(CHEMBL3884580)
Affinity DataEC50:  6.45E+3nM. Assay description: Agonist activity at recombinant human S1PR5 expressed in CHO cell membranes assessed as [35S]GTP-gammaS binding measured after 1.5 hrs by TopCount sc...
In DepthDetails ArticlePubMed
TargetSphingosine 1-phosphate receptor 4(Homo sapiens (Human))
Harvard Medical School
Curated by ChEMBL
LigandPNGBDBM50208996(CHEMBL3884580)
Affinity DataEC50:  2.06E+3nM. Assay description: Agonist activity at recombinant human S1PR4 expressed in CHO cell membranes assessed as [35S]GTP-gammaS binding measured after 1.5 hrs by TopCount sc...
In DepthDetails ArticlePubMed