BDBM50209185 6-(5-chloro-2-hydroxyphenyl)-4-(2-chloro-5-(trifluoromethyl)phenyl)-2-oxo-1,2-dihydropyridine-3-carbonitrile::CHEMBL236620
SMILES Oc1ccc(Cl)cc1-c1cc(-c2cc(ccc2Cl)C(F)(F)F)c(C#N)c(=O)[nH]1
InChI Key InChIKey=HDKUBJYDFUJSOG-UHFFFAOYSA-N
Data  1 Kd
  Tab Delimited (TSV)   2D SDfile   Computed 3D by Vconf -m prep SDfile
Find this compound or compounds like it in BindingDB:
Activity Spreadsheet -- Enzyme Inhibition Constant Data from BindingDB
Found 1 hit for monomerid = 50209185
TargetBaculoviral IAP repeat-containing protein 5(Homo sapiens (Human))
Abbott Laboratories
Curated by ChEMBL
LigandPNGBDBM50209185(6-(5-chloro-2-hydroxyphenyl)-4-(2-chloro-5-(triflu...)
Affinity DataKd:  520nM. Assay description: Binding affinity to human survivin expressed in Escherichia coli BL21 cells after 30 mins
In DepthDetails ArticlePubMed