BDBM50209803 3-(3-bromophenoxy)-N,N-dimethyl-3-(4-(3-(piperidin-1-yl)propoxy)phenyl)propan-1-amine::CHEMBL245921
SMILES CN(C)CCC(Oc1cccc(Br)c1)c1ccc(OCCCN2CCCCC2)cc1
InChI Key InChIKey=NQHRYUNHBWFEMY-UHFFFAOYSA-N
Data  3 KI
  Tab Delimited (TSV)   2D SDfile   Computed 3D by Vconf -m prep SDfile
Find this compound or compounds like it in BindingDB:
Activity Spreadsheet -- Enzyme Inhibition Constant Data from BindingDB
Found 3 hits for monomerid = 50209803
TargetHistamine H3 receptor(Homo sapiens (Human))
Johnson & Johnson Pharmaceutical Research & Development
Curated by ChEMBL
LigandPNGBDBM50209803(3-(3-bromophenoxy)-N,N-dimethyl-3-(4-(3-(piperidin...)
Affinity DataKi:  1nM. Assay description: Binding affinity at human histamine H3 receptor
In DepthDetails ArticlePubMed
TargetSodium-dependent serotonin transporter(Rattus norvegicus (rat))
Johnson & Johnson Pharmaceutical Research & Development
Curated by ChEMBL
LigandPNGBDBM50209803(3-(3-bromophenoxy)-N,N-dimethyl-3-(4-(3-(piperidin...)
Affinity DataKi:  2.30nM. Assay description: Binding affinity at rat SERT
In DepthDetails ArticlePubMed
TargetSodium-dependent serotonin transporter(Homo sapiens (Human))
Johnson & Johnson Pharmaceutical Research & Development
Curated by ChEMBL
LigandPNGBDBM50209803(3-(3-bromophenoxy)-N,N-dimethyl-3-(4-(3-(piperidin...)
Affinity DataKi:  4nM. Assay description: Binding affinity at human SERT
In DepthDetails ArticlePubMed