BDBM50210133 CHEMBL3194273
SMILES CN(C)c1ccc(\C=N\Nc2nncc3ccccc23)cc1
InChI Key InChIKey=CQEPAPNDTBMXHG-WOJGMQOQSA-N
Data  1 IC50
  Tab Delimited (TSV)   2D SDfile   Computed 3D by Vconf -m prep SDfile
Find this compound or compounds like it in BindingDB:
Activity Spreadsheet -- Enzyme Inhibition Constant Data from BindingDB
Found 1 hit for monomerid = 50210133
TargetMyeloperoxidase(Homo sapiens (Human))
Universit£
Curated by ChEMBL
LigandPNGBDBM50210133(CHEMBL3194273)
Affinity DataIC50:  80nM. Assay description: Inhibition of human MPO
In DepthDetails ArticlePubMed