BDBM50210281 (4-methylpiperazin-1-yl)(3-(5-(3-phenoxyprop-1-ynyl)thiophen-3-yl)-1,4-dihydroindeno[1,2-c]pyrazol-6-yl)methanone::CHEMBL390735
SMILES CN1CCN(CC1)C(=O)c1ccc-2c(Cc3c-2n[nH]c3-c2csc(c2)C#CCOc2ccccc2)c1
InChI Key InChIKey=DHIIDVRCCRSUHG-UHFFFAOYSA-N
Data  3 IC50
  Tab Delimited (TSV)   2D SDfile   Computed 3D by Vconf -m prep SDfile
Find this compound or compounds like it in BindingDB:
Activity Spreadsheet -- Enzyme Inhibition Constant Data from BindingDB
Found 3 hits for monomerid = 50210281
TargetVascular endothelial growth factor receptor 2(Homo sapiens (Human))
Abbott Laboratories
Curated by ChEMBL
LigandPNGBDBM50210281((4-methylpiperazin-1-yl)(3-(5-(3-phenoxyprop-1-yny...)
Affinity DataIC50:  29nM. Assay description: Inhibition of VEGF-induced phosphorylation of human KDR expressed in mouse NIH3T3 cell line by ELISA
In DepthDetails ArticlePubMed
TargetPotassium voltage-gated channel subfamily H member 2(Homo sapiens (Human))
Abbott Laboratories
Curated by ChEMBL
LigandPNGBDBM50210281((4-methylpiperazin-1-yl)(3-(5-(3-phenoxyprop-1-yny...)
Affinity DataIC50:  1.72E+3nM. Assay description: Inhibition of hERG expressed in HEK293 cells assessed as effect on ionic current by patch clamp assay
In DepthDetails ArticlePubMed
TargetVascular endothelial growth factor receptor 2(Homo sapiens (Human))
Abbott Laboratories
Curated by ChEMBL
LigandPNGBDBM50210281((4-methylpiperazin-1-yl)(3-(5-(3-phenoxyprop-1-yny...)
Affinity DataIC50:  44nM. Assay description: Inhibition of VEGF-induced phosphorylation of human KDR expressed in mouse NIH3T3 cell line by Western blot
In DepthDetails ArticlePubMed