BDBM50210769 CHEMBL3963893
SMILES N=C(NC(=N)N1CCN(CC1)C(=N)NC(=N)Nc1ccccc1)Nc1ccccc1
InChI Key InChIKey=CSZRZZFDERCVRH-UHFFFAOYSA-N
Data  4 KI
  Tab Delimited (TSV)   2D SDfile   Computed 3D by Vconf -m prep SDfile
Find this compound or compounds like it in BindingDB:
Activity Spreadsheet -- Enzyme Inhibition Constant Data from BindingDB
Found 4 hits for monomerid = 50210769
TargetCholinesterase(Equus caballus (Horse))
Martin-Luther-University Halle-Wittenberg
Curated by ChEMBL
LigandPNGBDBM50210769(CHEMBL3963893)
Affinity DataKi:  950nM. Assay description: Competitive inhibition of equine serum butyrylcholinesterase in presence of varying butyrylthiocholine iodide substrate level preincubated for 20 min...
In DepthDetails ArticlePubMed
TargetAcetylcholinesterase(Electrophorus electricus (Electric eel))
Martin-Luther-University Halle-Wittenberg
Curated by ChEMBL
LigandPNGBDBM50210769(CHEMBL3963893)
Affinity DataKi:  1.35E+4nM. Assay description: Competitive inhibition of Electrophorus electricus acetylcholinesterase in presence of varying acetylthiocholine iodide substrate level preincubated ...
In DepthDetails ArticlePubMed
TargetCholinesterase(Equus caballus (Horse))
Martin-Luther-University Halle-Wittenberg
Curated by ChEMBL
LigandPNGBDBM50210769(CHEMBL3963893)
Affinity DataKi: >4.00E+4nM. Assay description: Non-competitive inhibition of equine serum butyrylcholinesterase in presence of varying butyrylthiocholine iodide substrate level preincubated for 20...
In DepthDetails ArticlePubMed
TargetAcetylcholinesterase(Electrophorus electricus (Electric eel))
Martin-Luther-University Halle-Wittenberg
Curated by ChEMBL
LigandPNGBDBM50210769(CHEMBL3963893)
Affinity DataKi:  6.92E+4nM. Assay description: Non-competitive inhibition of Electrophorus electricus acetylcholinesterase in presence of varying acetylthiocholine iodide substrate level preincuba...
In DepthDetails ArticlePubMed