BDBM50210773 CHEMBL3968731
SMILES Clc1ccc(NC(=N)NC(=N)N2CCN(CC2)C(=N)NC(=N)Nc2ccc(Cl)cc2Cl)c(Cl)c1
InChI Key InChIKey=QOJPDZLAORGAEU-UHFFFAOYSA-N
Data  4 KI
  Tab Delimited (TSV)   2D SDfile   Computed 3D by Vconf -m prep SDfile
Find this compound or compounds like it in BindingDB:
Activity Spreadsheet -- Enzyme Inhibition Constant Data from BindingDB
Found 4 hits for monomerid = 50210773
TargetCholinesterase(Equus caballus (Horse))
Martin-Luther-University Halle-Wittenberg
Curated by ChEMBL
LigandPNGBDBM50210773(CHEMBL3968731)
Affinity DataKi:  410nM. Assay description: Competitive inhibition of equine serum butyrylcholinesterase in presence of varying butyrylthiocholine iodide substrate level preincubated for 20 min...
In DepthDetails ArticlePubMed
TargetCholinesterase(Equus caballus (Horse))
Martin-Luther-University Halle-Wittenberg
Curated by ChEMBL
LigandPNGBDBM50210773(CHEMBL3968731)
Affinity DataKi:  7.51E+3nM. Assay description: Non-competitive inhibition of equine serum butyrylcholinesterase in presence of varying butyrylthiocholine iodide substrate level preincubated for 20...
In DepthDetails ArticlePubMed
TargetAcetylcholinesterase(Electrophorus electricus (Electric eel))
Martin-Luther-University Halle-Wittenberg
Curated by ChEMBL
LigandPNGBDBM50210773(CHEMBL3968731)
Affinity DataKi:  9.34E+3nM. Assay description: Competitive inhibition of Electrophorus electricus acetylcholinesterase in presence of varying acetylthiocholine iodide substrate level preincubated ...
In DepthDetails ArticlePubMed
TargetAcetylcholinesterase(Electrophorus electricus (Electric eel))
Martin-Luther-University Halle-Wittenberg
Curated by ChEMBL
LigandPNGBDBM50210773(CHEMBL3968731)
Affinity DataKi:  7.53E+4nM. Assay description: Non-competitive inhibition of Electrophorus electricus acetylcholinesterase in presence of varying acetylthiocholine iodide substrate level preincuba...
In DepthDetails ArticlePubMed