BDBM50211136 (R)-N-(1-(3-(4-ethoxyphenyl)-4-oxo-3,4-dihydropyrido[3,2-d]pyrimidin-2-yl)ethyl)-N-(pyridin-3-ylmethyl)-2-(4-(trifluoromethoxy)phenyl)acetamide::CHEMBL374820
SMILES CCOc1ccc(cc1)-n1c(nc2cccnc2c1=O)[C@@H](C)N(Cc1cccnc1)C(=O)Cc1ccc(OC(F)(F)F)cc1
InChI Key InChIKey=FRZNGUHFMVBZAG-OAQYLSRUSA-N
Data  1 IC50
  Tab Delimited (TSV)   2D SDfile   Computed 3D by Vconf -m prep SDfile
Find this compound or compounds like it in BindingDB:
Activity Spreadsheet -- Enzyme Inhibition Constant Data from BindingDB
Found 1 hit for monomerid = 50211136
TargetC-X-C chemokine receptor type 3(Homo sapiens (Human))
Amgen
Curated by ChEMBL
LigandPNGBDBM50211136((R)-N-(1-(3-(4-ethoxyphenyl)-4-oxo-3,4-dihydropyri...)
Affinity DataIC50:  1.40E+3nM. Assay description: Displacement of [125I ]IP10 from CXCR3 receptor expressed in PBMC
In DepthDetails ArticlePubMed