BDBM50211581 2-((R)-1-((S)-2-((2-(aminomethyl)-5-chlorobenzyl)carbamoyl)pyrrolidin-1-yl)-1-oxo-4-(pyridin-2-yl)butan-2-ylamino)acetic acid::CHEMBL394517
SMILES NCc1ccc(Cl)cc1CNC(=O)[C@@H]1CCCN1C(=O)[C@@H](CCc1ccccn1)NCC(O)=O
InChI Key InChIKey=NYKOPIYZICLSFY-RTWAWAEBSA-N
Data  3 KI
  Tab Delimited (TSV)   2D SDfile   Computed 3D by Vconf -m prep SDfile
Find this compound or compounds like it in BindingDB:
Activity Spreadsheet -- Enzyme Inhibition Constant Data from BindingDB
Found 3 hits for monomerid = 50211581
TargetCoagulation factor X(Homo sapiens (Human))
Curacyte Discovery
Curated by ChEMBL
LigandPNGBDBM50211581(2-((R)-1-((S)-2-((2-(aminomethyl)-5-chlorobenzyl)c...)
Affinity DataKi:  1.5nM. Assay description: Inhibition of factor 10a
In DepthDetails ArticlePubMed
TargetProthrombin(Homo sapiens (Human))
Curacyte Discovery
Curated by ChEMBL
LigandPNGBDBM50211581(2-((R)-1-((S)-2-((2-(aminomethyl)-5-chlorobenzyl)c...)
Affinity DataKi:  3.5nM. Assay description: Inhibition of thrombin
In DepthDetails ArticlePubMed
TargetUrokinase-type plasminogen activator(Homo sapiens (Human))
Curacyte Discovery
Curated by ChEMBL
LigandPNGBDBM50211581(2-((R)-1-((S)-2-((2-(aminomethyl)-5-chlorobenzyl)c...)
Affinity DataKi: >5.00E+3nM. Assay description: Inhibition of uPA
In DepthDetails ArticlePubMed