BDBM50211669 CHEMBL3943220
SMILES CCCCNC(=S)NS(=O)(=O)c1ccc(NC(=O)Cn2c3ccccc3nc(C)c2=O)cc1
InChI Key InChIKey=LNIDEQPLVWKJHY-UHFFFAOYSA-N
Data  2 IC50
  Tab Delimited (TSV)   2D SDfile   Computed 3D by Vconf -m prep SDfile
Find this compound or compounds like it in BindingDB:
Activity Spreadsheet -- Enzyme Inhibition Constant Data from BindingDB
Found 2 hits for monomerid = 50211669
TargetPeroxisome proliferator-activated receptor gamma(Homo sapiens (Human))
Al-Azhar University
Curated by ChEMBL
LigandPNGBDBM50211669(CHEMBL3943220)
Affinity DataIC50:  4.00E+3nM. Assay description: Displacement of fluormone-PPARgamma green from GST-tagged PPARgamma-LBD (unknown origin) by fluorescence polarization assay
In DepthDetails ArticlePubMed
TargetPeroxisome proliferator-activated receptor gamma(Homo sapiens (Human))
Al-Azhar University
Curated by ChEMBL
LigandPNGBDBM50211669(CHEMBL3943220)
Affinity DataIC50:  369nM. Assay description: Displacement of fluormone-PPARgamma Green from recombinant human N-terminal GST-tagged PPARgamma-LBD by fluorescence polarization assay
In DepthDetails ArticlePubMed