BDBM50211684 4'-(2-furyl)-N-(2-methoxypyrimidin-5-yl)-4,5'-bipyrimidin-2'-amine::CHEMBL226236
SMILES COc1ncc(Nc2ncc(-c3ccncn3)c(n2)-c2ccco2)cn1
InChI Key InChIKey=ONXHHAADYYTDKN-UHFFFAOYSA-N
Data  4 KI
  Tab Delimited (TSV)   2D SDfile   Computed 3D by Vconf -m prep SDfile
Find this compound or compounds like it in BindingDB:
Activity Spreadsheet -- Enzyme Inhibition Constant Data from BindingDB
Found 4 hits for monomerid = 50211684
TargetAdenosine receptor A2b(Homo sapiens (Human))
Almirall
Curated by ChEMBL
LigandPNGBDBM50211684(4'-(2-furyl)-N-(2-methoxypyrimidin-5-yl)-4,5'-bipy...)
Affinity DataKi:  39nM. Assay description: Displacement of [3H]DPCPX from human A2B receptor expressed in HEK293 cellsChecked by Author
In DepthDetails ArticlePubMed
TargetAdenosine receptor A3(Homo sapiens (Human))
Almirall
Curated by ChEMBL
LigandPNGBDBM50211684(4'-(2-furyl)-N-(2-methoxypyrimidin-5-yl)-4,5'-bipy...)
Affinity DataKi: >1.00E+3nM. Assay description: Displacement of [2H]NECA from human A3 receptor expressed in HeLa cellsChecked by Author
In DepthDetails ArticlePubMed
TargetAdenosine receptor A2a(Homo sapiens (Human))
Almirall
Curated by ChEMBL
LigandPNGBDBM50211684(4'-(2-furyl)-N-(2-methoxypyrimidin-5-yl)-4,5'-bipy...)
Affinity DataKi: >2.50E+3nM. Assay description: Displacement of [3H]ZM241385 from human A2A receptor expressed in HeLa cellsChecked by Author
In DepthDetails ArticlePubMed
TargetAdenosine receptor A1(Homo sapiens (Human))
Almirall
Curated by ChEMBL
LigandPNGBDBM50211684(4'-(2-furyl)-N-(2-methoxypyrimidin-5-yl)-4,5'-bipy...)
Affinity DataKi: >1.00E+4nM. Assay description: Displacement of [3H]DPCPX from human A1 receptor expressed in CHO cellsChecked by Author
In DepthDetails ArticlePubMed