BDBM50212078 CHEMBL3926781
SMILES Cc1ccc(\C=C\c2cccc(c2)C(F)(F)F)cc1
InChI Key InChIKey=AIZQYCOYNWLQRG-MDZDMXLPSA-N
Data  1 EC50
  Tab Delimited (TSV)   2D SDfile   Computed 3D by Vconf -m prep SDfile
Find this compound or compounds like it in BindingDB:
Activity Spreadsheet -- Enzyme Inhibition Constant Data from BindingDB
Found 1 hit for monomerid = 50212078
TargetNuclear factor erythroid 2-related factor 2(Homo sapiens (Human))
University Of New Mexico
Curated by ChEMBL
LigandPNGBDBM50212078(CHEMBL3926781)
Affinity DataEC50:  1.50E+3nM. Assay description: Activation of Nrf2 (unknown origin) expressed in human HepG2 cells after 5 hrs by ARE-driven luciferase reporter gene assay
In DepthDetails ArticlePubMed