BDBM50212201 CHEMBL3945022
SMILES COc1cccc(\C=C\c2ccc(C)cc2)c1OC
InChI Key InChIKey=LFXMJRNULNIIIK-VAWYXSNFSA-N
Data  1 EC50
  Tab Delimited (TSV)   2D SDfile   Computed 3D by Vconf -m prep SDfile
Find this compound or compounds like it in BindingDB:
Activity Spreadsheet -- Enzyme Inhibition Constant Data from BindingDB
Found 1 hit for monomerid = 50212201
TargetNuclear factor erythroid 2-related factor 2(Homo sapiens (Human))
University Of New Mexico
Curated by ChEMBL
LigandPNGBDBM50212201(CHEMBL3945022)
Affinity DataEC50:  1.10E+3nM. Assay description: Activation of Nrf2 (unknown origin) expressed in human HepG2 cells after 5 hrs by ARE-driven luciferase reporter gene assay
In DepthDetails ArticlePubMed