BDBM50212334 CHEMBL106885
SMILES Oc1c(-c2ccsc2)c(=O)c(=O)[nH]c2cc(Cl)ccc12
InChI Key InChIKey=YTMLTYDEDOWMFT-UHFFFAOYSA-N
Data  1 IC50
  Tab Delimited (TSV)   2D SDfile   Computed 3D by Vconf -m prep SDfile
Find this compound or compounds like it in BindingDB:
Activity Spreadsheet -- Enzyme Inhibition Constant Data from BindingDB
Found 1 hit for monomerid = 50212334
TargetReplicase polyprotein 1ab(2019-nCoV)
University of Antwerp
Curated by ChEMBL
LigandPNGBDBM50212334(CHEMBL5290702)
Affinity DataIC50:  260nM. Assay description: Inhibitory activity against cell free dihydrofolate redutase (DHFR) from Mycobacterium lufu
In DepthDetails ArticlePubMed