BDBM50212401 3'-prenylnaringenin::CHEMBL229671
SMILES [#6]\[#6](-[#6])=[#6]\[#6]-c1cc(ccc1-[#8])-c1cc(=O)c2c(-[#8])cc(-[#8])cc2o1
InChI Key InChIKey=PFQMUQWFRINBBG-UHFFFAOYSA-N
Data  1 IC50
  Tab Delimited (TSV)   2D SDfile   Computed 3D by Vconf -m prep SDfile
Find this compound or compounds like it in BindingDB:
Activity Spreadsheet -- Enzyme Inhibition Constant Data from BindingDB
Found 1 hit for monomerid = 50212401
TargetTyrosine-protein phosphatase non-receptor type 1(Homo sapiens (Human))
Korea Research Institute Of Bioscience And Biotechnology
Curated by ChEMBL
LigandPNGBDBM50212401(3'-prenylnaringenin | CHEMBL229671)
Affinity DataIC50:  2.67E+4nM. Assay description: Inhibition of human recombinant PTP1B
In DepthDetails ArticlePubMed