BDBM50212493 3-(4'-hydroxy-biphenyl-4-yl)-1,4-dihydro-indeno[1,2-c]pyrazole-5-carboxylic acid (4-hydroxy-cyclohexyl)-amide::CHEMBL232803
SMILES O[C@H]1CC[C@@H](CC1)NC(=O)c1cccc-2c1Cc1c(n[nH]c-21)-c1ccc(cc1)-c1ccc(O)cc1
InChI Key InChIKey=BZBGEAGQFDVWJW-AQYVVDRMSA-N
Data  1 IC50
  Tab Delimited (TSV)   2D SDfile   Computed 3D by Vconf -m prep SDfile
Find this compound or compounds like it in BindingDB:
Activity Spreadsheet -- Enzyme Inhibition Constant Data from BindingDB
Found 1 hit for monomerid = 50212493
TargetSerine/threonine-protein kinase Chk1(Homo sapiens (Human))
Abbott Laboratories
Curated by ChEMBL
LigandPNGBDBM50212493(3-(4'-hydroxy-biphenyl-4-yl)-1,4-dihydro-indeno[1,...)
Affinity DataIC50: >1.00E+4nM. Assay description: Inhibition of recombinant CHK-mediated Cdc25C phosphorylation after 30 mins
In DepthDetails ArticlePubMed