BDBM50212787 1-(3-aminopropyl)-N-cyclohexyl-N-methyl-2-(thiophene-2-carboxamido)-1H-benzo[d]imidazole-5-carboxamide::CHEMBL233366
SMILES CN(C1CCCCC1)C(=O)c1ccc2n(CCCN)c(NC(=O)c3cccs3)nc2c1
InChI Key InChIKey=FCKYGPKVIITXMO-UHFFFAOYSA-N
Data  2 IC50
  Tab Delimited (TSV)   2D SDfile   Computed 3D by Vconf -m prep SDfile
Find this compound or compounds like it in BindingDB:
Activity Spreadsheet -- Enzyme Inhibition Constant Data from BindingDB
Found 2 hits for monomerid = 50212787
TargetTyrosine-protein kinase ITK/TSK(Homo sapiens (Human))
Boehringer Ingelheim Pharmaceuticals
Curated by ChEMBL
LigandPNGBDBM50212787(1-(3-aminopropyl)-N-cyclohexyl-N-methyl-2-(thiophe...)
Affinity DataIC50:  950nM. Assay description: Inhibition of human ITK by DELFIA assay
In DepthDetails ArticlePubMed
TargetTyrosine-protein kinase ITK/TSK(Homo sapiens (Human))
Boehringer Ingelheim Pharmaceuticals
Curated by ChEMBL
LigandPNGBDBM50212787(1-(3-aminopropyl)-N-cyclohexyl-N-methyl-2-(thiophe...)
Affinity DataIC50: >2.00E+4nM. Assay description: Effect on human ITK in DT40 cells assessed as induction of calcium influx by FLIPR assay
In DepthDetails ArticlePubMed