BDBM50212933 CHEMBL291120
SMILES BrCC(=O)NC1CCc2[nH]c3ccccc3c2C1
InChI Key InChIKey=PYQPNPOUJPDQJM-UHFFFAOYSA-N
Data  2 KI
  Tab Delimited (TSV)   2D SDfile   Computed 3D by Vconf -m prep SDfile
Find this compound or compounds like it in BindingDB:
Activity Spreadsheet -- Enzyme Inhibition Constant Data from BindingDB
Found 2 hits for monomerid = 50212933
TargetMelatonin receptor type 1C(Gallus gallus)
University College London
Curated by ChEMBL
LigandPNGBDBM50212933(CHEMBL291120)
Affinity DataKi:  740nM. Assay description: Binding affinity towards melatonin receptor, determined in chicken brain membranes using [2-125I]melatonin
In DepthDetails ArticlePubMed
TargetMelatonin receptor type 1C(Gallus gallus)
University College London
Curated by ChEMBL
LigandPNGBDBM50212933(CHEMBL291120)
Affinity DataKi:  740nM. Assay description: Binding affinity towards melatonin receptor was determined using 2-[125I]iodomelatonin as radioligand in chick brain membranes
In DepthDetails