BDBM50212942 CHEMBL417343
SMILES COc1ccc2[nH]c3CCC(Cc3c2c1)NC(=O)C(F)(F)F
InChI Key InChIKey=RGOMYKKRZRSDPU-UHFFFAOYSA-N
Data  2 KI
  Tab Delimited (TSV)   2D SDfile   Computed 3D by Vconf -m prep SDfile
Find this compound or compounds like it in BindingDB:
Activity Spreadsheet -- Enzyme Inhibition Constant Data from BindingDB
Found 2 hits for monomerid = 50212942
TargetMelatonin receptor type 1C(Gallus gallus)
University College London
Curated by ChEMBL
LigandPNGBDBM50212942(CHEMBL417343)
Affinity DataKi:  102nM. Assay description: Binding affinity towards melatonin receptor, determined in chicken brain membranes using [2-125I]melatonin
In DepthDetails ArticlePubMed
TargetMelatonin receptor type 1C(Gallus gallus)
University College London
Curated by ChEMBL
LigandPNGBDBM50212942(CHEMBL417343)
Affinity DataKi:  102nM. Assay description: Binding affinity towards melatonin receptor was determined using 2-[125I]iodomelatonin as radioligand in chick brain membranes
In DepthDetails