BDBM50212992 CHEMBL60543
SMILES CCC1CN2CC(C[C@@](C(=O)OC)(c3[nH]c4ccccc4c3CC2)c2cc3c(cc2OC)N(C)C2C33CCN4CC=CC(CC)(C34)C(OC(C)=O)[C@]2(O)C(=O)OC)[C@H]1c1ccccc1
InChI Key InChIKey=UMEMKHKOEKDJPG-CRNAOEFQSA-N
Data  2 IC50
  Tab Delimited (TSV)   2D SDfile   Computed 3D by Vconf -m prep SDfile
Find this compound or compounds like it in BindingDB:
Activity Spreadsheet -- Enzyme Inhibition Constant Data from BindingDB
Found 2 hits for monomerid = 50212992
LigandPNGBDBM50212992(CHEMBL60543)
Affinity DataIC50:  500nM. Assay description: In vitro inhibitory activity against bovine brain tubulin assembly at a concentration of 3-3.5 mg/ml
In DepthDetails
LigandPNGBDBM50212992(CHEMBL60543)
Affinity DataIC50:  500nM. Assay description: In vitro inhibitory activity against bovine brain tubulin assembly at a concentration of 3-3.5 mg/ml
In DepthDetails