BDBM50213400 CHEMBL391623::ethyl 4-(1-(4-hydroxybenzyl)-1H-imidazol-2-yl)-4-phenylpiperidine-1-carboxylate
SMILES CCOC(=O)N1CCC(CC1)(c1nccn1Cc1ccc(O)cc1)c1ccccc1
InChI Key InChIKey=KPOBZMXBVODHGB-UHFFFAOYSA-N
Data  3 KI
  Tab Delimited (TSV)   2D SDfile   Computed 3D by Vconf -m prep SDfile
Find this compound or compounds like it in BindingDB:
Activity Spreadsheet -- Enzyme Inhibition Constant Data from BindingDB
Found 3 hits for monomerid = 50213400
TargetDelta-type opioid receptor(Homo sapiens (Human))
Johnson & Johnson Pharmaceutical Research & Development
Curated by ChEMBL
LigandPNGBDBM50213400(CHEMBL391623 | ethyl 4-(1-(4-hydroxybenzyl)-1H-imi...)
Affinity DataKi:  4.60nM. Assay description: Displacement of [3H]DPDPE from cloned human delta opioid receptor
In DepthDetails ArticlePubMed
TargetKappa-type opioid receptor(Homo sapiens (Human))
Johnson & Johnson Pharmaceutical Research & Development
Curated by ChEMBL
LigandPNGBDBM50213400(CHEMBL391623 | ethyl 4-(1-(4-hydroxybenzyl)-1H-imi...)
Affinity DataKi:  108nM. Assay description: Displacement of [3H]U-69593 from cloned human kappa opioid receptor
In DepthDetails ArticlePubMed
TargetMu-type opioid receptor(Homo sapiens (Human))
Johnson & Johnson Pharmaceutical Research & Development
Curated by ChEMBL
LigandPNGBDBM50213400(CHEMBL391623 | ethyl 4-(1-(4-hydroxybenzyl)-1H-imi...)
Affinity DataKi: >465nM. Assay description: Displacement of [3H]DAMGO from cloned human mu opioid receptor
In DepthDetails ArticlePubMed