BDBM50213492 2-[2',4'-dihydroxy-3'-(3-methylbut-2-enyl)phenyl]-6-hydroxybenzofuran::CHEMBL232935
SMILES [#6]\[#6](-[#6])=[#6]\[#6]-c1c(-[#8])ccc(-c2cc3ccc(-[#8])cc3o2)c1-[#8]
InChI Key InChIKey=JTWAOWXXBMXCGP-UHFFFAOYSA-N
Data  2 IC50
  Tab Delimited (TSV)   2D SDfile   Computed 3D by Vconf -m prep SDfile
Find this compound or compounds like it in BindingDB:
Activity Spreadsheet -- Enzyme Inhibition Constant Data from BindingDB
Found 2 hits for monomerid = 50213492
TargetTyrosine-protein phosphatase non-receptor type 1(Homo sapiens (Human))
Peking University
Curated by ChEMBL
LigandPNGBDBM50213492(2-[2',4'-dihydroxy-3'-(3-methylbut-2-enyl)phenyl]-...)
Affinity DataIC50:  9.20E+3nM. Assay description: Inhibition of recombinant human PTP1B (1 to 321 residues) expressed in Escherichia coli using p-nitrophenyl phosphate as substrate incubated for 30 m...
In DepthDetails ArticlePubMed
TargetTyrosine-protein phosphatase non-receptor type 1(Homo sapiens (Human))
Peking University
Curated by ChEMBL
LigandPNGBDBM50213492(2-[2',4'-dihydroxy-3'-(3-methylbut-2-enyl)phenyl]-...)
Affinity DataIC50:  1.36E+4nM. Assay description: Inhibition of PTP1B
In DepthDetails ArticlePubMed