BDBM50213561 CHEMBL312937
SMILES CCCc1nc(SC(F)F)c(C(O)=O)n1Cc1ccc(cc1)-c1ccccc1S(=O)(=O)NC(=O)Cc1cccs1
InChI Key InChIKey=HIEZXLTZBARFLU-UHFFFAOYSA-N
Data  2 IC50
  Tab Delimited (TSV)   2D SDfile   Computed 3D by Vconf -m prep SDfile
Find this compound or compounds like it in BindingDB:
Activity Spreadsheet -- Enzyme Inhibition Constant Data from BindingDB
Found 2 hits for monomerid = 50213561
TargetType-1/Type-2 angiotensin II receptor(Homo sapiens (Human))TBA
LigandPNGBDBM50213561(CHEMBL312937)
Affinity DataIC50:  7.80nM. Assay description: In vitro displacement of [125I]angiotensin II from angiotensin 2 receptor on rabbit uterus membrane preparation
In DepthDetails
LigandPNGBDBM50213561(CHEMBL312937)
Affinity DataIC50:  0.0700nM. Assay description: In vitro displacement of [125I]angiotensin II from rat liver (Angiotensin 1 receptor) membrane preparation
In DepthDetails