BDBM50214000 CHEMBL243180::N-(4-((1-(2-fluorobenzyl)-3-(cyclopropylmethyl)-2,6-dioxo-2,3,6,7-tetrahydro-1H-purin-8-yl)methyl)phenyl)quinoline-8-sulfonamide
SMILES Fc1ccccc1Cn1c(=O)n(CC2CC2)c2nc(Cc3ccc(NS(=O)(=O)c4cccc5cccnc45)cc3)[nH]c2c1=O
InChI Key InChIKey=CWFVSQWFCKBNHT-UHFFFAOYSA-N
Data  1 IC50
  Tab Delimited (TSV)   2D SDfile   Computed 3D by Vconf -m prep SDfile
Find this compound or compounds like it in BindingDB:
Activity Spreadsheet -- Enzyme Inhibition Constant Data from BindingDB
Found 1 hit for monomerid = 50214000
TargetPhosphoenolpyruvate carboxykinase, cytosolic [GTP](Homo sapiens (Human))
Roche Research Center
Curated by ChEMBL
LigandPNGBDBM50214000(CHEMBL243180 | N-(4-((1-(2-fluorobenzyl)-3-(cyclop...)
Affinity DataIC50:  450nM. Assay description: Inhibition of human cPEPCK
In DepthDetails ArticlePubMed