BDBM50214260 (5R,8R,11S)-5-[(3-chlorophenyl)methyl]-8-(propan-2-yl)-11-(1H-pyrazol-1-ylmethyl)-3,4,5,6,7,8,9,10,11,12,13,14,15,16-tetradecahydro-2H-1,4,7,10,13-benzoxatetrazacyclooctadecine-6,9,12-trione::CHEMBL392657
SMILES CC(C)[C@H]1NC(=O)[C@@H](Cc2cccc(Cl)c2)NCCOc2ccccc2CCCNC(=O)[C@H](Cn2cccn2)NC1=O
InChI Key InChIKey=WIDBVUQLEVBIGW-FULLSBAXSA-N
Data  1 KI  1 IC50
  Tab Delimited (TSV)   2D SDfile   Computed 3D by Vconf -m prep SDfile
Find this compound or compounds like it in BindingDB:
Activity Spreadsheet -- Enzyme Inhibition Constant Data from BindingDB
Found 2 hits for monomerid = 50214260
TargetMotilin receptor(Homo sapiens (Human))
Tranzyme Pharma
Curated by ChEMBL
LigandPNGBDBM50214260((5R,8R,11S)-5-[(3-chlorophenyl)methyl]-8-(propan-2...)
Affinity DataKi:  18nM. Assay description: Displacement of [125I]-motilin from human motilin receptor expressed in CHO cells
In DepthDetails ArticlePubMed
TargetMotilin receptor(Homo sapiens (Human))
Tranzyme Pharma
Curated by ChEMBL
LigandPNGBDBM50214260((5R,8R,11S)-5-[(3-chlorophenyl)methyl]-8-(propan-2...)
Affinity DataIC50:  56nM. Assay description: Antagonist activity against human motilin receptor in aequoscreen cells assessed as inhibition of motilin induced calcium release by aequorin assay
In DepthDetails ArticlePubMed