BDBM50214649 5-butyl-1-(4-ethynylphenyl)-1H-1,2,3-triazole::CHEMBL237278
SMILES CCCCc1cnnn1-c1ccc(cc1)C#C
InChI Key InChIKey=WYIVVYNLIRBIMG-UHFFFAOYSA-N
Data  1 KI
  Tab Delimited (TSV)   2D SDfile   Computed 3D by Vconf -m prep SDfile
Find this compound or compounds like it in BindingDB:
Activity Spreadsheet -- Enzyme Inhibition Constant Data from BindingDB
Found 1 hit for monomerid = 50214649
TargetGamma-aminobutyric acid receptor subunit alpha-2/beta-2/gamma-2(Homo sapiens (Human))
Shimane University
Curated by ChEMBL
LigandPNGBDBM50214649(5-butyl-1-(4-ethynylphenyl)-1H-1,2,3-triazole | CH...)
Affinity DataKi: >9.15E+3nM. Assay description: Displacement of [3H]EBOB from human recombinant GABA alpha-1-beta-2-gamma-2 receptor expressed in HEK293 cells
In DepthDetails ArticlePubMed