BDBM50214659 1-(2,6-dichloro-4-trifluoromethylphenyl)-5-methyl-4-n-propyl-1H-1,2,3-triazole::CHEMBL236471
SMILES CCCc1nnn(c1C)-c1c(Cl)cc(cc1Cl)C(F)(F)F
InChI Key InChIKey=UXBYKUXVPASURW-UHFFFAOYSA-N
Data  2 KI
  Tab Delimited (TSV)   2D SDfile   Computed 3D by Vconf -m prep SDfile
Find this compound or compounds like it in BindingDB:
Activity Spreadsheet -- Enzyme Inhibition Constant Data from BindingDB
Found 2 hits for monomerid = 50214659
TargetGamma-aminobutyric acid receptor subunit beta-3(Homo sapiens (Human))
Shimane University
Curated by ChEMBL
LigandPNGBDBM50214659(1-(2,6-dichloro-4-trifluoromethylphenyl)-5-methyl-...)
Affinity DataKi:  1.90nM. Assay description: Displacement of [3H]EBOB from human recombinant GABAbeta3 receptor expressed in HEK293 cells
In DepthDetails ArticlePubMed
TargetGamma-aminobutyric acid receptor subunit alpha-2/beta-2/gamma-2(Homo sapiens (Human))
Shimane University
Curated by ChEMBL
LigandPNGBDBM50214659(1-(2,6-dichloro-4-trifluoromethylphenyl)-5-methyl-...)
Affinity DataKi:  322nM. Assay description: Displacement of [3H]EBOB from human recombinant GABA alpha-1-beta-2-gamma-2 receptor expressed in HEK293 cells
In DepthDetails ArticlePubMed