BDBM50214747 CHEMBL440146
SMILES CCc1ccc(cc1)C(CCN1CCN(CC1)c1ccccc1OC)Oc1ccc(cc1)C(=O)Nc1ccccc1OCCCC(O)=O
InChI Key InChIKey=FIBKNKOHOLWVRI-UHFFFAOYSA-N
Data  1 IC50
  Tab Delimited (TSV)   2D SDfile   Computed 3D by Vconf -m prep SDfile
Find this compound or compounds like it in BindingDB:
Activity Spreadsheet -- Enzyme Inhibition Constant Data from BindingDB
Found 1 hit for monomerid = 50214747
Target3-oxo-5-alpha-steroid 4-dehydrogenase 1/2(Rattus norvegicus)
Zeria Pharmaceutical
Curated by ChEMBL
LigandPNGBDBM50214747(CHEMBL440146)
Affinity DataIC50:  70nM. Assay description: Inhibitory activity against prostatic 5-alpha reductase in Sprague-Dawley rat
In DepthDetails ArticlePubMed