BDBM50214754 CHEMBL306058
SMILES O[C@@H]1[C@@H](Cc2ccccc2)COc2cc(ccc12)C(O)=O
InChI Key InChIKey=XMFMMHVVGNBJCW-XJKSGUPXSA-N
Data  2 IC50
  Tab Delimited (TSV)   2D SDfile   Computed 3D by Vconf -m prep SDfile
Find this compound or compounds like it in BindingDB:
Activity Spreadsheet -- Enzyme Inhibition Constant Data from BindingDB
Found 2 hits for monomerid = 50214754
TargetLeukotriene B4 receptor 1/2(Homo sapiens (Human))TBA
LigandPNGBDBM50214754(CHEMBL306058)
Affinity DataIC50: >1.00E+5nM. Assay description: Inhibition of [3H]flumazenil binding to recombinant GABA-A receptor alpha-5 subunit in cerebellum
In DepthDetails
TargetLeukotriene B4 receptor 1/2(Homo sapiens (Human))TBA
LigandPNGBDBM50214754(CHEMBL306058)
Affinity DataIC50:  2.00E+4nM. Assay description: Inhibition of leukotriene B4 (LTB4) binding to guinea pig spleen
In DepthDetails