BDBM50214764 CHEMBL307287
SMILES CNC(=O)C(C)(C)c1ccc2[C@H](O)[C@@H](Cc3ccccc3)COc2c1
InChI Key InChIKey=JYBRGQRNKFVJDJ-HNAYVOBHSA-N
Data  2 IC50
  Tab Delimited (TSV)   2D SDfile   Computed 3D by Vconf -m prep SDfile
Find this compound or compounds like it in BindingDB:
Activity Spreadsheet -- Enzyme Inhibition Constant Data from BindingDB
Found 2 hits for monomerid = 50214764
TargetLeukotriene B4 receptor 1/2(Homo sapiens (Human))TBA
LigandPNGBDBM50214764(CHEMBL307287)
Affinity DataIC50: >1.00E+5nM. Assay description: Inhibition of leukotriene B4 (LTB4) binding to guinea pig spleen
In DepthDetails
TargetLeukotriene B4 receptor 1/2(Homo sapiens (Human))TBA
LigandPNGBDBM50214764(CHEMBL307287)
Affinity DataIC50:  1.50E+3nM. Assay description: Inhibition of LTB4 receptor induced chemotaxis of isolated human neutrophils
In DepthDetails