BDBM50214765 CHEMBL74910
SMILES O[C@@H]1[C@@H](Cc2ccccc2)COc2cc(CC(O)=O)ccc12
InChI Key InChIKey=MKUQSXFTSJZNOF-KBXCAEBGSA-N
Data  4 IC50
  Tab Delimited (TSV)   2D SDfile   Computed 3D by Vconf -m prep SDfile
Find this compound or compounds like it in BindingDB:
Activity Spreadsheet -- Enzyme Inhibition Constant Data from BindingDB
Found 4 hits for monomerid = 50214765
TargetLeukotriene B4 receptor 1/2(Homo sapiens (Human))TBA
LigandPNGBDBM50214765(CHEMBL74910)
Affinity DataIC50:  2.50E+4nM. Assay description: Inhibition of leukotriene B4 (LTB4) binding to guinea pig spleen
In DepthDetails
TargetLeukotriene B4 receptor 1/2(Homo sapiens (Human))TBA
LigandPNGBDBM50214765(CHEMBL74910)
Affinity DataIC50:  2.50E+4nM. Assay description: Inhibition of leukotriene B4 (LTB4) binding to guinea pig spleen
In DepthDetails
TargetLeukotriene B4 receptor 1/2(Homo sapiens (Human))TBA
LigandPNGBDBM50214765(CHEMBL74910)
Affinity DataIC50:  1.20E+4nM. Assay description: Inhibition of LTB4 receptor induced chemotaxis of isolated human neutrophils
In DepthDetails
TargetLeukotriene B4 receptor 1/2(Homo sapiens (Human))TBA
LigandPNGBDBM50214765(CHEMBL74910)
Affinity DataIC50:  1.20E+4nM. Assay description: Inhibition of LTB4 receptor induced chemotaxis of isolated human neutrophils
In DepthDetails