BDBM50215001 CHEMBL247116::trans-N-(2-(5-chloro-1H-indole-2-sulfonamido)cyclopropyl)-5-methyl-4,5,6,7-tetrahydrothiazolo[5,4-c]pyridine-2-carboxamide
SMILES CN1CCc2nc(sc2C1)C(=O)N[C@@H]1C[C@H]1NS(=O)(=O)c1cc2cc(Cl)ccc2[nH]1
InChI Key InChIKey=PCHDFXFDIRPXNS-HUUCEWRRSA-N
Data  1 IC50
  Tab Delimited (TSV)   2D SDfile   Computed 3D by Vconf -m prep SDfile
Find this compound or compounds like it in BindingDB:
Activity Spreadsheet -- Enzyme Inhibition Constant Data from BindingDB
Found 1 hit for monomerid = 50215001
TargetCoagulation factor X(Homo sapiens (Human))
Daiichi Pharmaceutical
Curated by ChEMBL
LigandPNGBDBM50215001(CHEMBL247116 | trans-N-(2-(5-chloro-1H-indole-2-su...)
Affinity DataIC50: >1.00E+4nM. Assay description: Inhibition of human factor 10a after 10 seconds
In DepthDetails ArticlePubMed