BDBM50215106 8-pCPT-cAMP::CHEBI:84612::CHEMBL230552
SMILES [H][C@@]12COP(O)(=O)O[C@@]1([H])[C@@H](O)[C@@H](O2)n1c(Sc2ccc(Cl)cc2)nc2c(N)ncnc12
InChI Key InChIKey=AAZMHPMNAVEBRE-SDBHATRESA-N
Data  1 EC50
  Tab Delimited (TSV)   2D SDfile   Computed 3D by Vconf -m prep SDfile
Find this compound or compounds like it in BindingDB:
Activity Spreadsheet -- Enzyme Inhibition Constant Data from BindingDB
Found 1 hit for monomerid = 50215106
LigandPNGBDBM50215106(8-pCPT-cAMP | CHEBI:84612 | CHEMBL230552)
Affinity DataEC50:  2.00E+4nM. Assay description: Activation of cAMP dependent protein kinase (PKA)
In DepthDetails