BDBM50215138 CHEMBL317671
SMILES Cc1nccc(n1)-c1c(ncn1CCCN1CCOCC1)-c1ccc(F)cc1
InChI Key InChIKey=VHVNYPVBGUVDBF-UHFFFAOYSA-N
Data  1 IC50
  Tab Delimited (TSV)   2D SDfile   Computed 3D by Vconf -m prep SDfile
Find this compound or compounds like it in BindingDB:
Activity Spreadsheet -- Enzyme Inhibition Constant Data from BindingDB
Found 1 hit for monomerid = 50215138
TargetMitogen-activated protein kinase 11/12/13/14(Homo sapiens (Human))
Smithkline Beecham Pharmaceuticals
Curated by ChEMBL
LigandPNGBDBM50215138(CHEMBL317671)
Affinity DataIC50:  1.30E+3nM. Assay description: Compound was tested for inhibition of p38 MAP kinase
In DepthDetails ArticlePubMed