BDBM50215275 CHEMBL321851
SMILES Fc1ccc(cc1)-c1[nH]c2ncccc2c1-c1ccncc1
InChI Key InChIKey=KXKFTUKPFILYNH-UHFFFAOYSA-N
Data  1 IC50
  Tab Delimited (TSV)   2D SDfile   Computed 3D by Vconf -m prep SDfile
Find this compound or compounds like it in BindingDB:
Activity Spreadsheet -- Enzyme Inhibition Constant Data from BindingDB
Found 1 hit for monomerid = 50215275
TargetMitogen-activated protein kinase 11/12/13/14(Homo sapiens (Human))
R. W. Johnson Pharmaceutical Research Institute
Curated by ChEMBL
LigandPNGBDBM50215275(CHEMBL321851)
Affinity DataIC50:  400nM. Assay description: Inhibition of TNF-alpha production by lipopolysaccharide-stimulated human peripheral blood mononuclear cells
In DepthDetails ArticlePubMed